{"text_format":"3","workbook":"xlsx","n_sheets":7,"sheets":["In_out","Print","Total In Out","Industries Wise","Overlap_Equity","Overlap_Hybrid","Overlap_Debt"],"not_rendered":{"charts":2,"macros":1,"defined_names":7},"read":"whole","date_system":"1900"}

{"sheet":"In_out","index":0,"n_rows":54,"n_cols":17,"rows_kept":54}
[{"$nulls":3},"Shriram Multi Sector Rotation Fund","q",{"$nulls":10},"Shriram Aggressive Hybrid Fund","A1"]
[{"$nulls":3},{"$f":"\"As on \"&TEXT(H4,\"dd-Mmm-YYYY\")","v":{"$error":"#REF!"}},{"$nulls":11},"Shriram Flexi Cap Fund","F1"]
[{"$nulls":3},{"$f":"D1","v":"Shriram Multi Sector Rotation Fund"},{"$nulls":3},{"$f":"D1","v":"Shriram Multi Sector Rotation Fund"},{"$nulls":7},"Shriram ELSS Tax Saver Fund","K1"]
[null,null,"S.n","New Entrant","Complete Exit ",null,null,{"$f":"#REF!","v":{"$error":"#REF!"}},{"$nulls":7},"Shriram Balanced Advantage Fund","P1"]
[null,{"$f":"MAX('Total In Out'!M:M)","v":{"$error":"#REF!"}},1,{"$f":"IFERROR(VLOOKUP(C5,'Total In Out'!L:N,3,0),\"\")","v":""},{"$f":"IFERROR(VLOOKUP(B5,'Total In Out'!M:N,2,0),\"\")","v":""},{"$nulls":10},"Shriram Multi Asset Allocation Fund","U1"]
[null,{"$f":"IF(B5=\"\",\"\",IF(B5-1<1,\"\",B5-1))","v":{"$error":"#REF!"}},2,{"$f":"IFERROR(VLOOKUP(C6,'Total In Out'!L:N,3,0),\"\")","v":""},{"$f":"IFERROR(VLOOKUP(B6,'Total In Out'!M:N,2,0),\"\")","v":""},null,null,"New Entrant",{"$nulls":7},"Shriram Multi Sector Rotation Fund","Y1"]
[null,{"$error":"#REF!"},3,{"$f":"IFERROR(VLOOKUP(C7,'Total In Out'!L:N,3,0),\"\")","v":""},{"$f":"IFERROR(VLOOKUP(B7,'Total In Out'!M:N,2,0),\"\")","v":""},null,null,{"$f":"CONCATENATE(D5,\", \",D6,\", \",D7,\", \",D8,\", \",D9,\", \",D10,\", \",D11,\", \",D12,\", \",D13,\", \",D14,\", \",D15,\", \",D16,\", \",D17,\", \",D18,\", \",D19,\", \",D20,\", \",D21,\", \",D22,\", \",D23,\", \",D24,\", \",D25,\", \",D26,\", \",D27,\", \",D28,\", \",D29,\", \",D30,\", \",D31,\", \",D32,\", \",D33,\", \",D34,\", \",D35,\", \",D36,\", \",D37,\", \",D38,\", \",D39,\", \",D40,\", \",D41,\", \",D42,\", \",D43,\", \",D44)","v":", , , , , , , , , , , , , , , , , , , , , , , , , , , , , , , , , , , , , , , "}]
[null,{"$error":"#REF!"},4,{"$f":"IFERROR(VLOOKUP(C8,'Total In Out'!L:N,3,0),\"\")","v":""},{"$f":"IFERROR(VLOOKUP(B8,'Total In Out'!M:N,2,0),\"\")","v":""}]
{"$rows_left_out":47}
{"sheet":"Print","index":1,"n_rows":53,"n_cols":27,"rows_kept":53}
[null,"As on 28-Feb-2026",{"$nulls":4},"As on 28-Feb-2026",{"$nulls":4},"As on 28-Feb-2026",{"$nulls":4},"As on 28-Feb-2026",{"$nulls":4},"As on 28-Feb-2026",{"$nulls":3},"As on 28-Feb-2026"]
[null,"Shriram Aggressive Hybrid Fund",{"$nulls":4},"Shriram Flexi Cap Fund",{"$nulls":4},"Shriram ELSS Tax Saver Fund",{"$nulls":4},"Shriram Balanced Advantage Fund",{"$nulls":4},"Shriram Multi Asset Allocation Fund",{"$nulls":3},"Shriram Multi Sector Rotation Fund"]
["S.n","New Entrant","Complete Exit ",null,null,"S.n","New Entrant","Complete Exit ",null,null,"S.n","New Entrant","Complete Exit ",null,null,"S.n","New Entrant","Complete Exit ",null,null,"S.n","New Entrant","Complete Exit ",null,"S.n","New Entrant","Complete Exit "]
[1,"","",null,null,1,"MARICO","PNBHOUSING",null,null,1,"MARICO","PNBHOUSING",null,null,1,"","NH",null,null,1,"","",null,1,"",""]
[2,"","",null,null,2,"KIMS","CSBBANK",null,null,2,"KIMS","CSBBANK",null,null,2,"","",null,null,2,"","",null,2,"",""]
[3,"","",null,null,3,"NAVINFLUOR","DEEPAKFERT",null,null,3,"NAVINFLUOR","DEEPAKFERT",null,null,3,"","",null,null,3,"","",null,3,"",""]
[4,"","",null,null,4,"","",null,null,4,"","",null,null,4,"","",null,null,4,"","",null,4,"",""]
[5,"","",null,null,5,"","",null,null,5,"","",null,null,5,"","",null,null,5,"","",null,5,"",""]
{"$rows_left_out":46}
{"sheet":"Total In Out","index":2,"n_rows":217,"n_cols":14,"rows_kept":217}
[{"$f":"In_out!D1","v":"Shriram Multi Sector Rotation Fund"}]
[{"$nulls":4},{"$f":"\"Equity Portfolio as on \"&TEXT(#REF!,\"mmm dd, yyyy\")","v":{"$error":"#REF!"}},null,{"$f":"\"Equity Portfolio as on \"&TEXT(#REF!,\"mmm dd, yyyy\")","v":{"$error":"#REF!"}}]
["Categorization as per SEBI","Industries Wise","security","isin_code","% To AUM","units","% To AUM","units","Diff in Unit","Diff in % to AUM","Remark","New Buy","Total Exit","NSE SYMBOL"]
[{"$f":"TRIM(VLOOKUP(D4,#REF!,9,0))","v":{"$error":"#REF!"}},{"$f":"IFERROR(VLOOKUP($D4,#REF!,7,0),\"\")","v":""},{"$f":"VLOOKUP(D4,#REF!,2,0)","v":{"$error":"#REF!"}},"INE002A01018",{"$f":"SUMIFS(#REF!,#REF!,A$1,#REF!,$D4)/100","v":{"$error":"#REF!"}},{"$f":"SUMIFS(#REF!,#REF!,A$1,#REF!,$D4)","v":{"$error":"#REF!"}},{"$f":"SUMIFS(#REF!,#REF!,A$1,#REF!,$D4)/100","v":{"$error":"#REF!"}},{"$f":"SUMIFS(#REF!,#REF!,A$1,#REF!,$D4)","v":{"$error":"#REF!"}},{"$f":"F4-H4","v":{"$error":"#REF!"}},{"$f":"E4-G4","v":{"$error":"#REF!"}},{"$f":"IF(OR(F4+H4=0,I4=0),\"\",IF(I4=F4,\"New Buy\",IF(I4=-H4,\"Total Exit\",IF(H4>F4,\"Partial Sell\",\"Additional Buy\"))))","v":{"$error":"#REF!"}},{"$f":"IF($K4=\"New Buy\",(COUNTIFS($K$4:$K$125,$K4,J$4:J$125,\">\"&J4)+1),\"-\")","v":{"$error":"#REF!"}},{"$f":"IF($K4=\"Total Exit\",(COUNTIFS($K$4:$K$125,$K4,J$4:J$125,\">\"&J4)+1),\"-\")","v":{"$error":"#REF!"}},{"$f":"VLOOKUP(D4,#REF!,2,0)","v":{"$error":"#REF!"}}]
[{"$f":"TRIM(VLOOKUP(D5,#REF!,9,0))","v":{"$error":"#REF!"}},{"$f":"IFERROR(VLOOKUP($D5,#REF!,7,0),\"\")","v":""},{"$f":"VLOOKUP(D5,#REF!,2,0)","v":{"$error":"#REF!"}},"INE003A01024",{"$f":"SUMIFS(#REF!,#REF!,A$1,#REF!,$D5)/100","v":{"$error":"#REF!"}},{"$f":"SUMIFS(#REF!,#REF!,A$1,#REF!,$D5)","v":{"$error":"#REF!"}},{"$f":"SUMIFS(#REF!,#REF!,A$1,#REF!,$D5)/100","v":{"$error":"#REF!"}},{"$f":"SUMIFS(#REF!,#REF!,A$1,#REF!,$D5)","v":{"$error":"#REF!"}},{"$error":"#REF!"},{"$error":"#REF!"},{"$f":"IF(OR(F5+H5=0,I5=0),\"\",IF(I5=F5,\"New Buy\",IF(I5=-H5,\"Total Exit\",IF(H5>F5,\"Partial Sell\",\"Additional Buy\"))))","v":{"$error":"#REF!"}},{"$error":"#REF!"},{"$error":"#REF!"},{"$f":"VLOOKUP(D5,#REF!,2,0)","v":{"$error":"#REF!"}}]
[{"$f":"TRIM(VLOOKUP(D6,#REF!,9,0))","v":{"$error":"#REF!"}},{"$f":"IFERROR(VLOOKUP($D6,#REF!,7,0),\"\")","v":""},{"$f":"VLOOKUP(D6,#REF!,2,0)","v":{"$error":"#REF!"}},"INE009A01021",{"$f":"SUMIFS(#REF!,#REF!,A$1,#REF!,$D6)/100","v":{"$error":"#REF!"}},{"$f":"SUMIFS(#REF!,#REF!,A$1,#REF!,$D6)","v":{"$error":"#REF!"}},{"$f":"SUMIFS(#REF!,#REF!,A$1,#REF!,$D6)/100","v":{"$error":"#REF!"}},{"$f":"SUMIFS(#REF!,#REF!,A$1,#REF!,$D6)","v":{"$error":"#REF!"}},{"$error":"#REF!"},{"$error":"#REF!"},{"$error":"#REF!"},{"$error":"#REF!"},{"$error":"#REF!"},{"$f":"VLOOKUP(D6,#REF!,2,0)","v":{"$error":"#REF!"}}]
[{"$f":"TRIM(VLOOKUP(D7,#REF!,9,0))","v":{"$error":"#REF!"}},{"$f":"IFERROR(VLOOKUP($D7,#REF!,7,0),\"\")","v":""},{"$f":"VLOOKUP(D7,#REF!,2,0)","v":{"$error":"#REF!"}},"INE00H001014",{"$f":"SUMIFS(#REF!,#REF!,A$1,#REF!,$D7)/100","v":{"$error":"#REF!"}},{"$f":"SUMIFS(#REF!,#REF!,A$1,#REF!,$D7)","v":{"$error":"#REF!"}},{"$f":"SUMIFS(#REF!,#REF!,A$1,#REF!,$D7)/100","v":{"$error":"#REF!"}},{"$f":"SUMIFS(#REF!,#REF!,A$1,#REF!,$D7)","v":{"$error":"#REF!"}},{"$error":"#REF!"},{"$error":"#REF!"},{"$error":"#REF!"},{"$error":"#REF!"},{"$error":"#REF!"},{"$f":"VLOOKUP(D7,#REF!,2,0)","v":{"$error":"#REF!"}}]
[{"$f":"TRIM(VLOOKUP(D8,#REF!,9,0))","v":{"$error":"#REF!"}},{"$f":"IFERROR(VLOOKUP($D8,#REF!,7,0),\"\")","v":""},{"$f":"VLOOKUP(D8,#REF!,2,0)","v":{"$error":"#REF!"}},"INE018A01030",{"$f":"SUMIFS(#REF!,#REF!,A$1,#REF!,$D8)/100","v":{"$error":"#REF!"}},{"$f":"SUMIFS(#REF!,#REF!,A$1,#REF!,$D8)","v":{"$error":"#REF!"}},{"$f":"SUMIFS(#REF!,#REF!,A$1,#REF!,$D8)/100","v":{"$error":"#REF!"}},{"$f":"SUMIFS(#REF!,#REF!,A$1,#REF!,$D8)","v":{"$error":"#REF!"}},{"$error":"#REF!"},{"$error":"#REF!"},{"$error":"#REF!"},{"$error":"#REF!"},{"$error":"#REF!"},{"$f":"VLOOKUP(D8,#REF!,2,0)","v":{"$error":"#REF!"}}]
{"$rows_left_out":184}
{"sheet":"Industries Wise","index":3,"n_rows":108,"n_cols":33,"rows_kept":108}
[{"$f":"\"Equity Portfolio as on \"&TEXT($O$1,\"mmmm dd, yyyy\")","v":{"$error":"#REF!"}},{"$nulls":13},{"$f":"TEXT(#REF!,\"mmmm dd, yyyy\")","v":{"$error":"#REF!"}},null,"Holding %",{"$nulls":7},"Rank"]
["Industry","Shriram Aggressive Hybrid Fund","Shriram Flexi Cap Fund","Shriram ELSS Tax Saver Fund","Shriram Balanced Advantage Fund","Shriram Multi Asset Allocation Fund","Shriram Multi Sector Rotation Fund","Shriram Overnight Fund","Shriram Nifty 1D Rate Liquid ETF","Shriram Liquid Fund","Shriram Money Market Fund",{"$nulls":5},{"$f":"B2","v":"Shriram Aggressive Hybrid Fund"},"Shriram Flexi Cap Fund","Shriram ELSS Tax Saver Fund","Shriram Balanced Advantage Fund","Shriram Multi Asset Allocation Fund","Shriram Multi Sector Rotation Fund",null,null,{"$f":"B2","v":"Shriram Aggressive Hybrid Fund"},"Shriram Flexi Cap Fund","Shriram ELSS Tax Saver Fund","Shriram Balanced Advantage Fund","Shriram Multi Asset Allocation Fund","Shriram Multi Sector Rotation Fund",null,null,"Industry"]
[{"$f":"#REF!","v":{"$error":"#REF!"}},{"$f":"SUMIFS(#REF!,#REF!,B$2,#REF!,$A3)/100","v":{"$error":"#REF!"}},{"$f":"SUMIFS(#REF!,#REF!,C$2,#REF!,$A3)/100","v":{"$error":"#REF!"}},{"$f":"SUMIFS(#REF!,#REF!,D$2,#REF!,$A3)/100","v":{"$error":"#REF!"}},{"$f":"SUMIFS(#REF!,#REF!,E$2,#REF!,$A3)/100","v":{"$error":"#REF!"}},{"$f":"SUMIFS(#REF!,#REF!,F$2,#REF!,$A3)/100","v":{"$error":"#REF!"}},{"$f":"SUMIFS(#REF!,#REF!,G$2,#REF!,$A3)/100","v":{"$error":"#REF!"}},{"$nulls":7},{"$f":"COUNTIF(C$3:C3,C3)","v":1},null,{"$f":"SUMIFS(#REF!,#REF!,Q$2,#REF!,$A3)","v":{"$error":"#REF!"}},{"$f":"SUMIFS(#REF!,#REF!,R$2,#REF!,$A3)","v":{"$error":"#REF!"}},{"$f":"SUMIFS(#REF!,#REF!,S$2,#REF!,$A3)","v":{"$error":"#REF!"}},{"$f":"SUMIFS(#REF!,#REF!,T$2,#REF!,$A3)","v":{"$error":"#REF!"}},{"$f":"SUMIFS(#REF!,#REF!,U$2,#REF!,$A3)","v":{"$error":"#REF!"}},{"$f":"SUMIFS(#REF!,#REF!,V$2,#REF!,$A3)","v":{"$error":"#REF!"}},null,null,{"$f":"IF(Q3=0,\"\",RANK(Q3,Q$3:Q$42)+COUNTIF(Q$3:Q3,Q3)-1)","v":{"$error":"#REF!"}},{"$f":"IF(R3=0,\"\",RANK(R3,R$3:R$42)+COUNTIF(R$3:R3,R3)-1)","v":{"$error":"#REF!"}},{"$f":"IF(S3=0,\"\",RANK(S3,S$3:S$42)+COUNTIF(S$3:S3,S3)-1)","v":{"$error":"#REF!"}},{"$f":"IF(T3=0,\"\",RANK(T3,T$3:T$42)+COUNTIF(T$3:T3,T3)-1)","v":{"$error":"#REF!"}},{"$f":"IF(U3=0,\"\",RANK(U3,U$3:U$42)+COUNTIF(U$3:U3,U3)-1)","v":{"$error":"#REF!"}},{"$f":"IF(V3=0,\"\",RANK(V3,V$3:V$42)+COUNTIF(V$3:V3,V3)-1)","v":{"$error":"#REF!"}},null,null,{"$f":"A3","v":{"$error":"#REF!"}}]
[{"$f":"#REF!","v":{"$error":"#REF!"}},{"$f":"SUMIFS(#REF!,#REF!,B$2,#REF!,$A4)/100","v":{"$error":"#REF!"}},{"$f":"SUMIFS(#REF!,#REF!,C$2,#REF!,$A4)/100","v":{"$error":"#REF!"}},{"$f":"SUMIFS(#REF!,#REF!,D$2,#REF!,$A4)/100","v":{"$error":"#REF!"}},{"$f":"SUMIFS(#REF!,#REF!,E$2,#REF!,$A4)/100","v":{"$error":"#REF!"}},{"$f":"SUMIFS(#REF!,#REF!,F$2,#REF!,$A4)/100","v":{"$error":"#REF!"}},{"$f":"SUMIFS(#REF!,#REF!,G$2,#REF!,$A4)/100","v":{"$error":"#REF!"}},{"$nulls":7},{"$f":"COUNTIF(C$3:C4,C4)","v":2},null,{"$f":"SUMIFS(#REF!,#REF!,Q$2,#REF!,$A4)","v":{"$error":"#REF!"}},{"$f":"SUMIFS(#REF!,#REF!,R$2,#REF!,$A4)","v":{"$error":"#REF!"}},{"$f":"SUMIFS(#REF!,#REF!,S$2,#REF!,$A4)","v":{"$error":"#REF!"}},{"$f":"SUMIFS(#REF!,#REF!,T$2,#REF!,$A4)","v":{"$error":"#REF!"}},{"$f":"SUMIFS(#REF!,#REF!,U$2,#REF!,$A4)","v":{"$error":"#REF!"}},{"$f":"SUMIFS(#REF!,#REF!,V$2,#REF!,$A4)","v":{"$error":"#REF!"}},null,null,{"$f":"IF(Q4=0,\"\",RANK(Q4,Q$3:Q$42)+COUNTIF(Q$3:Q4,Q4)-1)","v":{"$error":"#REF!"}},{"$f":"IF(R4=0,\"\",RANK(R4,R$3:R$42)+COUNTIF(R$3:R4,R4)-1)","v":{"$error":"#REF!"}},{"$f":"IF(S4=0,\"\",RANK(S4,S$3:S$42)+COUNTIF(S$3:S4,S4)-1)","v":{"$error":"#REF!"}},{"$f":"IF(T4=0,\"\",RANK(T4,T$3:T$42)+COUNTIF(T$3:T4,T4)-1)","v":{"$error":"#REF!"}},{"$f":"IF(U4=0,\"\",RANK(U4,U$3:U$42)+COUNTIF(U$3:U4,U4)-1)","v":{"$error":"#REF!"}},{"$f":"IF(V4=0,\"\",RANK(V4,V$3:V$42)+COUNTIF(V$3:V4,V4)-1)","v":{"$error":"#REF!"}},null,null,{"$error":"#REF!"}]
[{"$f":"#REF!","v":{"$error":"#REF!"}},{"$f":"SUMIFS(#REF!,#REF!,B$2,#REF!,$A5)/100","v":{"$error":"#REF!"}},{"$f":"SUMIFS(#REF!,#REF!,C$2,#REF!,$A5)/100","v":{"$error":"#REF!"}},{"$f":"SUMIFS(#REF!,#REF!,D$2,#REF!,$A5)/100","v":{"$error":"#REF!"}},{"$f":"SUMIFS(#REF!,#REF!,E$2,#REF!,$A5)/100","v":{"$error":"#REF!"}},{"$f":"SUMIFS(#REF!,#REF!,F$2,#REF!,$A5)/100","v":{"$error":"#REF!"}},{"$f":"SUMIFS(#REF!,#REF!,G$2,#REF!,$A5)/100","v":{"$error":"#REF!"}},{"$nulls":7},{"$f":"COUNTIF(C$3:C5,C5)","v":3},null,{"$f":"SUMIFS(#REF!,#REF!,Q$2,#REF!,$A5)","v":{"$error":"#REF!"}},{"$f":"SUMIFS(#REF!,#REF!,R$2,#REF!,$A5)","v":{"$error":"#REF!"}},{"$f":"SUMIFS(#REF!,#REF!,S$2,#REF!,$A5)","v":{"$error":"#REF!"}},{"$f":"SUMIFS(#REF!,#REF!,T$2,#REF!,$A5)","v":{"$error":"#REF!"}},{"$f":"SUMIFS(#REF!,#REF!,U$2,#REF!,$A5)","v":{"$error":"#REF!"}},{"$f":"SUMIFS(#REF!,#REF!,V$2,#REF!,$A5)","v":{"$error":"#REF!"}},null,null,{"$f":"IF(Q5=0,\"\",RANK(Q5,Q$3:Q$42)+COUNTIF(Q$3:Q5,Q5)-1)","v":{"$error":"#REF!"}},{"$f":"IF(R5=0,\"\",RANK(R5,R$3:R$42)+COUNTIF(R$3:R5,R5)-1)","v":{"$error":"#REF!"}},{"$f":"IF(S5=0,\"\",RANK(S5,S$3:S$42)+COUNTIF(S$3:S5,S5)-1)","v":{"$error":"#REF!"}},{"$f":"IF(T5=0,\"\",RANK(T5,T$3:T$42)+COUNTIF(T$3:T5,T5)-1)","v":{"$error":"#REF!"}},{"$f":"IF(U5=0,\"\",RANK(U5,U$3:U$42)+COUNTIF(U$3:U5,U5)-1)","v":{"$error":"#REF!"}},{"$f":"IF(V5=0,\"\",RANK(V5,V$3:V$42)+COUNTIF(V$3:V5,V5)-1)","v":{"$error":"#REF!"}},null,null,{"$error":"#REF!"}]
[{"$f":"#REF!","v":{"$error":"#REF!"}},{"$f":"SUMIFS(#REF!,#REF!,B$2,#REF!,$A6)/100","v":{"$error":"#REF!"}},{"$f":"SUMIFS(#REF!,#REF!,C$2,#REF!,$A6)/100","v":{"$error":"#REF!"}},{"$f":"SUMIFS(#REF!,#REF!,D$2,#REF!,$A6)/100","v":{"$error":"#REF!"}},{"$f":"SUMIFS(#REF!,#REF!,E$2,#REF!,$A6)/100","v":{"$error":"#REF!"}},{"$f":"SUMIFS(#REF!,#REF!,F$2,#REF!,$A6)/100","v":{"$error":"#REF!"}},{"$f":"SUMIFS(#REF!,#REF!,G$2,#REF!,$A6)/100","v":{"$error":"#REF!"}},{"$nulls":7},{"$f":"COUNTIF(C$3:C6,C6)","v":4},null,{"$f":"SUMIFS(#REF!,#REF!,Q$2,#REF!,$A6)","v":{"$error":"#REF!"}},{"$f":"SUMIFS(#REF!,#REF!,R$2,#REF!,$A6)","v":{"$error":"#REF!"}},{"$f":"SUMIFS(#REF!,#REF!,S$2,#REF!,$A6)","v":{"$error":"#REF!"}},{"$f":"SUMIFS(#REF!,#REF!,T$2,#REF!,$A6)","v":{"$error":"#REF!"}},{"$f":"SUMIFS(#REF!,#REF!,U$2,#REF!,$A6)","v":{"$error":"#REF!"}},{"$f":"SUMIFS(#REF!,#REF!,V$2,#REF!,$A6)","v":{"$error":"#REF!"}},null,null,{"$f":"IF(Q6=0,\"\",RANK(Q6,Q$3:Q$42)+COUNTIF(Q$3:Q6,Q6)-1)","v":{"$error":"#REF!"}},{"$f":"IF(R6=0,\"\",RANK(R6,R$3:R$42)+COUNTIF(R$3:R6,R6)-1)","v":{"$error":"#REF!"}},{"$f":"IF(S6=0,\"\",RANK(S6,S$3:S$42)+COUNTIF(S$3:S6,S6)-1)","v":{"$error":"#REF!"}},{"$f":"IF(T6=0,\"\",RANK(T6,T$3:T$42)+COUNTIF(T$3:T6,T6)-1)","v":{"$error":"#REF!"}},{"$f":"IF(U6=0,\"\",RANK(U6,U$3:U$42)+COUNTIF(U$3:U6,U6)-1)","v":{"$error":"#REF!"}},{"$f":"IF(V6=0,\"\",RANK(V6,V$3:V$42)+COUNTIF(V$3:V6,V6)-1)","v":{"$error":"#REF!"}},null,null,{"$error":"#REF!"}]
[{"$f":"#REF!","v":{"$error":"#REF!"}},{"$f":"SUMIFS(#REF!,#REF!,B$2,#REF!,$A7)/100","v":{"$error":"#REF!"}},{"$f":"SUMIFS(#REF!,#REF!,C$2,#REF!,$A7)/100","v":{"$error":"#REF!"}},{"$f":"SUMIFS(#REF!,#REF!,D$2,#REF!,$A7)/100","v":{"$error":"#REF!"}},{"$f":"SUMIFS(#REF!,#REF!,E$2,#REF!,$A7)/100","v":{"$error":"#REF!"}},{"$f":"SUMIFS(#REF!,#REF!,F$2,#REF!,$A7)/100","v":{"$error":"#REF!"}},{"$f":"SUMIFS(#REF!,#REF!,G$2,#REF!,$A7)/100","v":{"$error":"#REF!"}},{"$nulls":7},{"$f":"COUNTIF(C$3:C7,C7)","v":5},null,{"$f":"SUMIFS(#REF!,#REF!,Q$2,#REF!,$A7)","v":{"$error":"#REF!"}},{"$f":"SUMIFS(#REF!,#REF!,R$2,#REF!,$A7)","v":{"$error":"#REF!"}},{"$f":"SUMIFS(#REF!,#REF!,S$2,#REF!,$A7)","v":{"$error":"#REF!"}},{"$f":"SUMIFS(#REF!,#REF!,T$2,#REF!,$A7)","v":{"$error":"#REF!"}},{"$f":"SUMIFS(#REF!,#REF!,U$2,#REF!,$A7)","v":{"$error":"#REF!"}},{"$f":"SUMIFS(#REF!,#REF!,V$2,#REF!,$A7)","v":{"$error":"#REF!"}},null,null,{"$f":"IF(Q7=0,\"\",RANK(Q7,Q$3:Q$42)+COUNTIF(Q$3:Q7,Q7)-1)","v":{"$error":"#REF!"}},{"$f":"IF(R7=0,\"\",RANK(R7,R$3:R$42)+COUNTIF(R$3:R7,R7)-1)","v":{"$error":"#REF!"}},{"$f":"IF(S7=0,\"\",RANK(S7,S$3:S$42)+COUNTIF(S$3:S7,S7)-1)","v":{"$error":"#REF!"}},{"$f":"IF(T7=0,\"\",RANK(T7,T$3:T$42)+COUNTIF(T$3:T7,T7)-1)","v":{"$error":"#REF!"}},{"$f":"IF(U7=0,\"\",RANK(U7,U$3:U$42)+COUNTIF(U$3:U7,U7)-1)","v":{"$error":"#REF!"}},{"$f":"IF(V7=0,\"\",RANK(V7,V$3:V$42)+COUNTIF(V$3:V7,V7)-1)","v":{"$error":"#REF!"}},null,null,{"$error":"#REF!"}]
[{"$f":"#REF!","v":{"$error":"#REF!"}},{"$f":"SUMIFS(#REF!,#REF!,B$2,#REF!,$A8)/100","v":{"$error":"#REF!"}},{"$f":"SUMIFS(#REF!,#REF!,C$2,#REF!,$A8)/100","v":{"$error":"#REF!"}},{"$f":"SUMIFS(#REF!,#REF!,D$2,#REF!,$A8)/100","v":{"$error":"#REF!"}},{"$f":"SUMIFS(#REF!,#REF!,E$2,#REF!,$A8)/100","v":{"$error":"#REF!"}},{"$f":"SUMIFS(#REF!,#REF!,F$2,#REF!,$A8)/100","v":{"$error":"#REF!"}},{"$f":"SUMIFS(#REF!,#REF!,G$2,#REF!,$A8)/100","v":{"$error":"#REF!"}},{"$nulls":7},{"$f":"COUNTIF(C$3:C8,C8)","v":6},null,{"$f":"SUMIFS(#REF!,#REF!,Q$2,#REF!,$A8)","v":{"$error":"#REF!"}},{"$f":"SUMIFS(#REF!,#REF!,R$2,#REF!,$A8)","v":{"$error":"#REF!"}},{"$f":"SUMIFS(#REF!,#REF!,S$2,#REF!,$A8)","v":{"$error":"#REF!"}},{"$f":"SUMIFS(#REF!,#REF!,T$2,#REF!,$A8)","v":{"$error":"#REF!"}},{"$f":"SUMIFS(#REF!,#REF!,U$2,#REF!,$A8)","v":{"$error":"#REF!"}},{"$f":"SUMIFS(#REF!,#REF!,V$2,#REF!,$A8)","v":{"$error":"#REF!"}},null,null,{"$f":"IF(Q8=0,\"\",RANK(Q8,Q$3:Q$42)+COUNTIF(Q$3:Q8,Q8)-1)","v":{"$error":"#REF!"}},{"$f":"IF(R8=0,\"\",RANK(R8,R$3:R$42)+COUNTIF(R$3:R8,R8)-1)","v":{"$error":"#REF!"}},{"$f":"IF(S8=0,\"\",RANK(S8,S$3:S$42)+COUNTIF(S$3:S8,S8)-1)","v":{"$error":"#REF!"}},{"$f":"IF(T8=0,\"\",RANK(T8,T$3:T$42)+COUNTIF(T$3:T8,T8)-1)","v":{"$error":"#REF!"}},{"$f":"IF(U8=0,\"\",RANK(U8,U$3:U$42)+COUNTIF(U$3:U8,U8)-1)","v":{"$error":"#REF!"}},{"$f":"IF(V8=0,\"\",RANK(V8,V$3:V$42)+COUNTIF(V$3:V8,V8)-1)","v":{"$error":"#REF!"}},null,null,{"$error":"#REF!"}]
{"$rows_left_out":95}
{"sheet":"Overlap_Equity","index":4,"n_rows":84,"n_cols":26,"rows_kept":84}
[null,"As on 28-Feb-2026","Category wise portfolio overlap levels- equity scheme vs other equity schemes"]
[{"$nulls":4},{"$f":"E3&\" Vs \"&F3","v":"Shriram Flexi Cap Fund Vs Shriram ELSS Tax Saver Fund"},{"$nulls":4},{"$f":"J3&\" Vs \"&K3","v":"Shriram Flexi Cap Fund Vs Shriram Multi Sector Rotation Fund"},{"$nulls":4},{"$f":"O3&\" Vs \"&P3","v":"Shriram ELSS Tax Saver Fund Vs Shriram Multi Sector Rotation Fund"}]
[{"$nulls":3},"INV_TYPE","Shriram Flexi Cap Fund","Shriram ELSS Tax Saver Fund","Overlap",null,null,"Shriram Flexi Cap Fund","Shriram Multi Sector Rotation Fund","Overlap",null,null,"Shriram ELSS Tax Saver Fund","Shriram Multi Sector Rotation Fund","Overlap"]
[null,"ISIN","Security Desc","INV_TYPE","Weight %","Weight %","Weight %",null,null,"Weight %","Weight %","Weight %",null,null,"Weight %","Weight %","Weight %"]
[null,"INE002A01018","RELIANCE INDUSTRIES LTD","Investment - Equities",{"v":3.1941,"d":"3.19"},{"v":3.1587,"d":"3.16"},{"v":3.1587,"d":"3.16"},null,null,{"v":3.1941,"d":"3.19"},{"v":0,"d":"0.00"},{"v":0,"d":"0.00"},null,null,{"v":3.1587,"d":"3.16"},{"v":0,"d":"0.00"},{"v":0,"d":"0.00"}]
[null,"INE009A01021","INFOSYS LTD","Investment - Equities",{"v":2.8117,"d":"2.81"},{"v":2.789,"d":"2.79"},{"v":2.789,"d":"2.79"},null,null,{"v":2.8117,"d":"2.81"},{"v":3.4391,"d":"3.44"},{"v":2.8117,"d":"2.81"},null,null,{"v":2.789,"d":"2.79"},{"v":3.4391,"d":"3.44"},{"v":2.789,"d":"2.79"}]
[null,"INE00H001014","SWIGGY LIMITED","Investment - Equities",{"v":0.7069,"d":"0.71"},{"v":0.7042,"d":"0.70"},{"v":0.7042,"d":"0.70"},null,null,{"v":0.7069,"d":"0.71"},{"v":1.6716,"d":"1.67"},{"v":0.7069,"d":"0.71"},null,null,{"v":0.7042,"d":"0.70"},{"v":1.6716,"d":"1.67"},{"v":0.7042,"d":"0.70"},{"$nulls":8},"INV_TYPE"]
[null,"INE018A01030","LARSEN & TOUBRO LTD","Investment - Equities",{"v":2.6432,"d":"2.64"},{"v":2.6182,"d":"2.62"},{"v":2.6182,"d":"2.62"},null,null,{"v":2.6432,"d":"2.64"},{"v":0,"d":"0.00"},{"v":0,"d":"0.00"},null,null,{"v":2.6182,"d":"2.62"},{"v":0,"d":"0.00"},{"v":0,"d":"0.00"},{"$nulls":8},"Investment - Certificate of Deposit"]
{"$rows_left_out":77}
{"sheet":"Overlap_Hybrid","index":5,"n_rows":104,"n_cols":26,"rows_kept":104}
[null,"As on 28-Feb-2026","Category wise portfolio overlap levels-  hybrid vs other hybrid schemes"]
[{"$nulls":4},{"$f":"E3&\" Vs \"&F3","v":"Shriram Aggressive Hybrid Fund Vs Shriram Balanced Advantage Fund"},{"$nulls":4},{"$f":"J3&\" Vs \"&K3","v":"Shriram Aggressive Hybrid Fund Vs Shriram Multi Asset Allocation Fund"},{"$nulls":4},{"$f":"O3&\" Vs \"&P3","v":"Shriram Balanced Advantage Fund Vs Shriram Multi Asset Allocation Fund"}]
[{"$nulls":3},"INV_TYPE","Shriram Aggressive Hybrid Fund","Shriram Balanced Advantage Fund","Overlap",null,null,"Shriram Aggressive Hybrid Fund","Shriram Multi Asset Allocation Fund","Overlap",null,null,"Shriram Balanced Advantage Fund","Shriram Multi Asset Allocation Fund","Overlap"]
[null,"ISIN","Security Desc","INV_TYPE","Weight %","Weight %","Weight %",null,null,"Weight %","Weight %","Weight %",null,null,"Weight %","Weight %","Weight %"]
[null,"IN0020210244","6.54% GOVT OF INDIA RED 17-01-2032","Investment - Government Bonds",{"v":6.1036,"d":"6.10"},{"v":3.6961,"d":"3.70"},{"v":3.6961,"d":"3.70"},null,null,{"v":6.1036,"d":"6.10"},{"v":0,"d":"0.00"},{"v":0,"d":"0.00"},null,null,{"v":3.6961,"d":"3.70"},{"v":0,"d":"0.00"},{"v":0,"d":"0.00"}]
[null,"IN002025Z047","364 DAYS TBILL RED 23-04-2026","Investment - Treasury Bills",{"v":0.5983,"d":"0.60"},{"v":0.9058,"d":"0.91"},{"v":0.5983,"d":"0.60"},null,null,{"v":0.5983,"d":"0.60"},{"v":0.4791,"d":"0.48"},{"v":0.4791,"d":"0.48"},null,null,{"v":0.9058,"d":"0.91"},{"v":0.4791,"d":"0.48"},{"v":0.4791,"d":"0.48"}]
[null,"INE002A01018","RELIANCE INDUSTRIES LTD","Investment - Equities",{"v":4.5408,"d":"4.54"},{"v":5.1042,"d":"5.10"},{"v":4.5408,"d":"4.54"},null,null,{"v":4.5408,"d":"4.54"},{"v":5.0015,"d":"5.00"},{"v":4.5408,"d":"4.54"},null,null,{"v":5.1042,"d":"5.10"},{"v":5.0015,"d":"5.00"},{"v":5.0015,"d":"5.00"},{"$nulls":8},"INV_TYPE"]
[null,"INE003A01024","SIEMENS LTD","Investment - Equities",{"v":0.6458,"d":"0.65"},{"v":0.4118,"d":"0.41"},{"v":0.4118,"d":"0.41"},null,null,{"v":0.6458,"d":"0.65"},{"v":0,"d":"0.00"},{"v":0,"d":"0.00"},null,null,{"v":0.4118,"d":"0.41"},{"v":0,"d":"0.00"},{"v":0,"d":"0.00"},{"$nulls":8},"Investment - Certificate of Deposit"]
{"$rows_left_out":97}
{"sheet":"Overlap_Debt","index":6,"n_rows":31,"n_cols":26,"rows_kept":31}
[null,"As on 28-Feb-2026","Category wise portfolio overlap levels -  debt scheme vs other debt schemes"]
[{"$nulls":4},{"$f":"E3&\" Vs \"&F3","v":"Shriram Liquid Fund Vs Shriram Money Market Fund"},{"$nulls":4},{"$f":"J3&\" Vs \"&K3","v":"Shriram Liquid Fund Vs Shriram Overnight Fund"},{"$nulls":4},{"$f":"O3&\" Vs \"&P3","v":"Shriram Money Market Fund Vs Shriram Overnight Fund"}]
[{"$nulls":3},"INV_TYPE","Shriram Liquid Fund","Shriram Money Market Fund","Overlap",null,null,"Shriram Liquid Fund","Shriram Overnight Fund","Overlap",null,null,"Shriram Money Market Fund","Shriram Overnight Fund","Overlap"]
[null,"ISIN","Security Desc","INV_TYPE","Weight %","Weight %","Weight %",null,null,"Weight %","Weight %","Weight %",null,null,"Weight %","Weight %","Weight %"]
[null,"IN002025X372","91 DAYS TBILL RED 12-03-2026","Investment - Treasury Bills",{"v":6.7264,"d":"6.73"},{"v":0,"d":"0.00"},{"v":0,"d":"0.00"},null,null,{"v":6.7264,"d":"6.73"},{"v":0,"d":"0.00"},{"v":0,"d":"0.00"},null,null,{"v":0,"d":"0.00"},{"v":0,"d":"0.00"},{"v":0,"d":"0.00"}]
[null,"IN002025X448","91 DAYS TBILL RED 07-05-2026","Investment - Treasury Bills",{"v":4.448,"d":"4.45"},{"v":0,"d":"0.00"},{"v":0,"d":"0.00"},null,null,{"v":4.448,"d":"4.45"},{"v":0,"d":"0.00"},{"v":0,"d":"0.00"},null,null,{"v":0,"d":"0.00"},{"v":0,"d":"0.00"},{"v":0,"d":"0.00"}]
[null,"IN002025Z377","364 DAYS TBILL RED 10-12-2026","Investment - Treasury Bills",{"v":0,"d":"0.00"},{"v":1.3832,"d":"1.38"},{"v":0,"d":"0.00"},null,null,{"v":0,"d":"0.00"},{"v":0,"d":"0.00"},{"v":0,"d":"0.00"},null,null,{"v":1.3832,"d":"1.38"},{"v":0,"d":"0.00"},{"v":0,"d":"0.00"},{"$nulls":8},"INV_TYPE"]
[null,"INE028A16HW0","BANK OF BARODA CD RED 06-03-26","Investment - Certificate of Deposit",{"v":6.7311,"d":"6.73"},{"v":0,"d":"0.00"},{"v":0,"d":"0.00"},null,null,{"v":6.7311,"d":"6.73"},{"v":0,"d":"0.00"},{"v":0,"d":"0.00"},null,null,{"v":0,"d":"0.00"},{"v":0,"d":"0.00"},{"v":0,"d":"0.00"},{"$nulls":8},"Investment - Certificate of Deposit"]
{"$rows_left_out":23}